Reaction Details
TargetEndothelin-1 receptor
LigandBDBM50032181
Substrate/Competitorn/a
Meas. Tech.ChEMBL_63185 (CHEMBL677396)
IC50 3.5±n/a nM
Citation Cody, WLHe, JXDePue, PLWaite, LALeonard, DMSefler, AMKaltenbronn, JSHaleen, SJWalker, DMFlynn, MA Structure-activity relationships of the potent combined endothelin-A/endothelin-B receptor antagonist Ac-DDip16-Leu-Asp-Ile-Ile-Trp21: development of endothelin-B receptor selective antagonists. J Med Chem38:2809-19 (1995) Endothelin-1 receptor
Name:Endothelin-1 receptor
Type:Enzyme Catalytic Domain
Mol. Mass.:48736.88
Organism:Homo sapiens (Human)
Description:P25101
Residue:427
BDBM50032181
NameBDBM50032181
Synonyms:2-{1-[1-(2-carboxy-1-{1-[10,11-dihydro-5H-dibenzo[a,d]cyclohepten-5-yl(methylcarboxamido)methylcarboxamido]-3-methylbutylcarboxamido}ethylcarboxamido)-2-methylbutylcarboxamido]-2-methylbutylcarboxamido}-3-(1H-3-indolyl)propanoic acid CHEMBL262993
TypeSmall organic molecule
Emp. Form.C52H67N7O10
Mol. Mass.950.1293
SMILESCC[C@H](C)[C@H](NC(=O)[C@@H](NC(=O)[C@H](CC(O)=O)NC(=O)[C@H](CC(C)C)NC(=O)[C@@H](NC(C)=O)C1c2ccccc2CCc2ccccc12)[C@@H](C)CC)C(=O)N[C@@H](Cc1c[nH]c2ccccc12)C(O)=O