Reaction Details
TargetEndothelin receptor type B
LigandBDBM50032172
Substrate/Competitorn/a
Meas. Tech.ChEMBL_64046 (CHEMBL677406)
IC50 20±n/a nM
Citation Cody, WLHe, JXDePue, PLWaite, LALeonard, DMSefler, AMKaltenbronn, JSHaleen, SJWalker, DMFlynn, MA Structure-activity relationships of the potent combined endothelin-A/endothelin-B receptor antagonist Ac-DDip16-Leu-Asp-Ile-Ile-Trp21: development of endothelin-B receptor selective antagonists. J Med Chem38:2809-19 (1995) Endothelin receptor type B
Name:Endothelin receptor type B
Type:Enzyme Catalytic Domain
Mol. Mass.:49483.43
Organism:RAT
Description:ENDOTHELIN B EDNRB RAT::P21451
Residue:442
BDBM50032172
NameBDBM50032172
Synonyms:(S)-3-[(S)-2-((S)-2-Acetylamino-3,3-diphenyl-propionylamino)-4-methyl-pentanoylamino]-N-((1S,2S)-1-{(1S,2S)-1-[(S)-1-carboxy-2-(1H-indol-3-yl)-ethylcarbamoyl]-2-methyl-butylcarbamoyl}-2-methyl-butyl)-succinamic acid | CHEMBL328942
TypeSmall organic molecule
Emp. Form.C50H65N7O10
Mol. Mass.924.092
SMILESCC[C@H](C)[C@H](NC(=O)[C@@H](NC(=O)[C@H](CC(O)=O)NC(=O)[C@H](CC(C)C)NC(=O)[C@@H](NC(C)=O)C(c1ccccc1)c1ccccc1)[C@@H](C)CC)C(=O)N[C@@H](Cc1c[nH]c2ccccc12)C(O)=O