Reaction Details
TargetRetinoic acid receptor beta
LigandBDBM50032225
Substrate/Competitorn/a
Meas. Tech.ChEMBL_195475 (CHEMBL798152)
EC50>0.001±n/a nM
Citation Beard, RLChandraratna, RAColon, DFGillett, SJHenry, EMarler, DKSong, TDenys, LGarst, MEArefieg, T Synthesis and structure-activity relationships of stilbene retinoid analogs substituted with heteroaromatic carboxylic acids. J Med Chem38:2820-9 (1995) Retinoic acid receptor beta
Name:Retinoic acid receptor beta
Type:PROTEIN
Mol. Mass.:50498.70
Organism:Homo sapiens (Human)
Description:ChEMBL_1458015
Residue:455
BDBM50032225
NameBDBM50032225
Synonyms:5-[(E)-2-(3,5,5,8,8-Pentamethyl-5,6,7,8-tetrahydro-naphthalen-2-yl)-propenyl]-thiophene-3-carboxylic acid | CHEMBL93628
TypeSmall organic molecule
Emp. Form.C23H28O2S
Mol. Mass.368.532
SMILESC\C(=C/c1cc(cs1)C(O)=O)c1cc2c(cc1C)C(C)(C)CCC2(C)C