Reaction Details
TargetRetinoic acid receptor RXR-alpha
LigandBDBM50032223
Substrate/Competitorn/a
Meas. Tech.ChEMBL_196751 (CHEMBL803332)
EC50 112±n/a nM
Citation Beard, RLChandraratna, RAColon, DFGillett, SJHenry, EMarler, DKSong, TDenys, LGarst, MEArefieg, T Synthesis and structure-activity relationships of stilbene retinoid analogs substituted with heteroaromatic carboxylic acids. J Med Chem38:2820-9 (1995) Retinoic acid receptor RXR-alpha
Name:Retinoic acid receptor RXR-alpha
Type:PROTEIN
Mol. Mass.:50820.38
Organism:Homo sapiens (Human)
Description:ChEMBL_1456363
Residue:462
BDBM50032223
NameBDBM50032223
Synonyms:4-[(E)-2-(3,5,5,8,8-Pentamethyl-5,6,7,8-tetrahydro-naphthalen-2-yl)-propenyl]-thiophene-2-carboxylic acid | CHEMBL316336
TypeSmall organic molecule
Emp. Form.C23H28O2S
Mol. Mass.368.532
SMILESC\C(=C/c1csc(c1)C(O)=O)c1cc2c(cc1C)C(C)(C)CCC2(C)C