Reaction Details
TargetCannabinoid receptor 1
LigandBDBM50032575
Substrate/Competitorn/a
Meas. Tech.ChEMBL_46624 (CHEMBL658880)
IC50 5.9±n/a nM
Citation Eissenstat, MABell, MRD'Ambra, TEAlexander, EJDaum, SJAckerman, JHGruett, MDKumar, VEstep, KGOlefirowicz, EM Aminoalkylindoles: structure-activity relationships of novel cannabinoid mimetics. J Med Chem38:3094-105 (1995) Cannabinoid receptor 1
Name:Cannabinoid receptor 1
Type:G Protein-Coupled Receptor (GPCR)
Mol. Mass.:52856.55
Organism:Rattus norvegicus (rat)
Description:P20272
Residue:473
BDBM50032575
NameBDBM50032575
Synonyms:CHEMBL309763 | [2-Methyl-1-(2-morpholin-4-yl-ethyl)-1H-indol-3-yl]-(4-methyl-naphthalen-1-yl)-methanone
TypeSmall organic molecule
Emp. Form.C27H28N2O2
Mol. Mass.412.5234
SMILESCc1c(C(=O)c2ccc(C)c3ccccc23)c2ccccc2n1CCN1CCOCC1