Reaction Details
TargetCannabinoid receptor 1
LigandBDBM50032613
Substrate/Competitorn/a
Meas. Tech.ChEMBL_46624 (CHEMBL658880)
IC50 35±n/a nM
Citation Eissenstat, MABell, MRD'Ambra, TEAlexander, EJDaum, SJAckerman, JHGruett, MDKumar, VEstep, KGOlefirowicz, EM Aminoalkylindoles: structure-activity relationships of novel cannabinoid mimetics. J Med Chem38:3094-105 (1995) Cannabinoid receptor 1
Name:Cannabinoid receptor 1
Type:G Protein-Coupled Receptor (GPCR)
Mol. Mass.:52856.55
Organism:Rattus norvegicus (rat)
Description:P20272
Residue:473
BDBM50032613
NameBDBM50032613
Synonyms:CHEMBL78308 | [5-Fluoro-1-(2-morpholin-4-yl-ethyl)-1H-indol-3-yl]-naphthalen-1-yl-methanone
TypeSmall organic molecule
Emp. Form.C25H23FN2O2
Mol. Mass.402.4607
SMILESFc1ccc2n(CCN3CCOCC3)cc(C(=O)c3cccc4ccccc34)c2c1