Reaction Details
TargetCannabinoid receptor 1
LigandBDBM50032596
Substrate/Competitorn/a
Meas. Tech.ChEMBL_46624 (CHEMBL658880)
IC50 37±n/a nM
Citation Eissenstat, MABell, MRD'Ambra, TEAlexander, EJDaum, SJAckerman, JHGruett, MDKumar, VEstep, KGOlefirowicz, EM Aminoalkylindoles: structure-activity relationships of novel cannabinoid mimetics. J Med Chem38:3094-105 (1995) Cannabinoid receptor 1
Name:Cannabinoid receptor 1
Type:G Protein-Coupled Receptor (GPCR)
Mol. Mass.:52856.55
Organism:Rattus norvegicus (rat)
Description:P20272
Residue:473
BDBM50032596
NameBDBM50032596
Synonyms:CHEMBL311645 | [2-Methyl-1-(2-piperidin-1-yl-ethyl)-1H-indol-3-yl]-naphthalen-1-yl-methanone
TypeSmall organic molecule
Emp. Form.C27H28N2O
Mol. Mass.396.524
SMILESCc1c(C(=O)c2cccc3ccccc23)c2ccccc2n1CCN1CCCCC1