Reaction Details
TargetD(3) dopamine receptor
LigandBDBM50032641
Substrate/Competitorn/a
Meas. Tech.ChEMBL_62296 (CHEMBL675218)
Ki 5±n/a nM
Citation Glase, SACorbin, AEPugsley, TAHeffner, TGWise, LD Synthesis and dopaminergic activity of pyridine analogs of 5-hydroxy-2-(di-n-propylamino)tetralin. J Med Chem38:3132-7 (1995) D(3) dopamine receptor
Name:D(3) dopamine receptor
Type:n/a
Mol. Mass.:44243.43
Organism:Homo sapiens (Human)
Description:n/a
Residue:400
BDBM50032641
NameBDBM50032641
Synonyms:CHEMBL105977 | Dipropyl-(5,6,7,8-tetrahydro-quinolin-6-yl)-amine
TypeSmall organic molecule
Emp. Form.C15H24N2
Mol. Mass.232.3645
SMILESCCCN(CCC)C1CCc2ncccc2C1