Reaction Details
TargetRetinoic acid receptor RXR-alpha
LigandBDBM50032674
Substrate/Competitorn/a
Meas. Tech.ChEMBL_196764 (CHEMBL797916)
Kd 670±n/a nM
Citation Boehm, MFZhang, LZhi, LMcClurg, MRBerger, EWagoner, MMais, DESuto, CMDavies, JAHeyman, RA Design and synthesis of potent retinoid X receptor selective ligands that induce apoptosis in leukemia cells. J Med Chem38:3146-55 (1995) Retinoic acid receptor RXR-alpha
Name:Retinoic acid receptor RXR-alpha
Type:PROTEIN
Mol. Mass.:50820.38
Organism:Homo sapiens (Human)
Description:ChEMBL_1456363
Residue:462
BDBM50032674
NameBDBM50032674
Synonyms:4-[2-(3,5,5,8,8-Pentamethyl-5,6,7,8-tetrahydro-naphthalen-2-yl)-oxiranyl]-benzoic acid | CHEMBL106817
TypeSmall organic molecule
Emp. Form.C24H28O3
Mol. Mass.364.4773
SMILESCc1cc2c(cc1C1(CO1)c1ccc(cc1)C(O)=O)C(C)(C)CCC2(C)C