Reaction Details
TargetRetinoic acid receptor RXR-alpha
LigandBDBM50032667
Substrate/Competitorn/a
Meas. Tech.ChEMBL_196764 (CHEMBL797916)
Kd 138±n/a nM
Citation Boehm, MFZhang, LZhi, LMcClurg, MRBerger, EWagoner, MMais, DESuto, CMDavies, JAHeyman, RA Design and synthesis of potent retinoid X receptor selective ligands that induce apoptosis in leukemia cells. J Med Chem38:3146-55 (1995) Retinoic acid receptor RXR-alpha
Name:Retinoic acid receptor RXR-alpha
Type:PROTEIN
Mol. Mass.:50820.38
Organism:Homo sapiens (Human)
Description:ChEMBL_1456363
Residue:462
BDBM50032667
NameBDBM50032667
Synonyms:4-(3,5,5,8,8-Pentamethyl-5,6,7,8-tetrahydro-naphthalene-2-carbonyl)-benzoic acid CHEMBL98172
TypeSmall organic molecule
Emp. Form.C23H26O3
Mol. Mass.350.4507
SMILESCc1cc2c(cc1C(=O)c1ccc(cc1)C(O)=O)C(C)(C)CCC2(C)C