Reaction Details
TargetRetinoic acid receptor RXR-alpha
LigandBDBM50032668
Substrate/Competitorn/a
Meas. Tech.ChEMBL_196764 (CHEMBL797916)
Kd 50±n/a nM
Citation Boehm, MFZhang, LZhi, LMcClurg, MRBerger, EWagoner, MMais, DESuto, CMDavies, JAHeyman, RA Design and synthesis of potent retinoid X receptor selective ligands that induce apoptosis in leukemia cells. J Med Chem38:3146-55 (1995) Retinoic acid receptor RXR-alpha
Name:Retinoic acid receptor RXR-alpha
Type:PROTEIN
Mol. Mass.:50820.38
Organism:Homo sapiens (Human)
Description:ChEMBL_1456363
Residue:462
BDBM50032668
NameBDBM50032668
Synonyms:4-[2-Methyl-1-(3,5,5,8,8-pentamethyl-5,6,7,8-tetrahydro-naphthalen-2-yl)-propenyl]-benzoic acid | CHEMBL25244
TypeSmall organic molecule
Emp. Form.C26H32O2
Mol. Mass.376.5311
SMILES[#6]\[#6](-[#6])=[#6](/c1ccc(cc1)-[#6](-[#8])=O)-c1cc2c(cc1-[#6])C([#6])([#6])[#6]-[#6]C2([#6])[#6]