Reaction Details
TargetRetinoic acid receptor RXR-beta
LigandBDBM50032677
Substrate/Competitorn/a
Meas. Tech.ChEMBL_197067 (CHEMBL806656)
Kd 150±n/a nM
Citation Boehm, MFZhang, LZhi, LMcClurg, MRBerger, EWagoner, MMais, DESuto, CMDavies, JAHeyman, RA Design and synthesis of potent retinoid X receptor selective ligands that induce apoptosis in leukemia cells. J Med Chem38:3146-55 (1995) Retinoic acid receptor RXR-beta
Name:Retinoic acid receptor RXR-beta
Type:PROTEIN
Mol. Mass.:55877.78
Organism:Mus musculus
Description:ChEMBL_196588
Residue:520
BDBM50032677
NameBDBM50032677
Synonyms:4-[1-(3,5,5,8,8-Pentamethyl-5,6,7,8-tetrahydro-naphthalen-2-yl)-ethyl]-benzoic acid | CHEMBL105979
TypeSmall organic molecule
Emp. Form.C24H30O2
Mol. Mass.350.4938
SMILESCC(c1ccc(cc1)C(O)=O)c1cc2c(cc1C)C(C)(C)CCC2(C)C