Reaction Details
TargetCathepsin S
LigandBDBM50032805
Substrate/Competitorn/a
Meas. Tech.ChEMBL_48683 (CHEMBL658353)
Ki 1.8±n/a nM
Citation Palmer, JTRasnick, DKlaus, JLBrömme, D Vinyl sulfones as mechanism-based cysteine protease inhibitors. J Med Chem38:3193-6 (1995) Cathepsin S
Name:Cathepsin S
Type:Protein
Mol. Mass.:37507.38
Organism:Homo sapiens (Human)
Description:P25774
Residue:331
BDBM50032805
NameBDBM50032805
Synonyms:CHEMBL107495 | N-[2-(3-Morpholin-4-yl-ureido)-1-naphthalen-2-ylmethyl-2-oxo-ethyl]-2-[(E)-2-(naphthalene-2-sulfonyl)-vinylamino]-4-phenyl-butyramide
TypeSmall organic molecule
Emp. Form.C40H41N5O6S
Mol. Mass.719.848
SMILESO=C(NN1CCOCC1)NC(=O)C(Cc1ccc2ccccc2c1)NC(=O)C(CCc1ccccc1)N=CCS(=O)(=O)c1ccc2ccccc2c1