Reaction Details
TargetRetinoic acid receptor alpha
LigandBDBM31892
Substrate/Competitorn/a
Meas. Tech.ChEMBL_195306 (CHEMBL799862)
EC50 23±n/a nM
Citation Dawson, MIJong, LHobbs, PDCameron, JFChao, WRPfahl, MLee, MOShroot, BPfahl, M Conformational effects on retinoid receptor selectivity. 2. Effects of retinoid bridging group on retinoid X receptor activity and selectivity. J Med Chem38:3368-83 (1995) Retinoic acid receptor alpha
Name:Retinoic acid receptor alpha
Type:PROTEIN
Mol. Mass.:50778.87
Organism:Homo sapiens (Human)
Description:ChEMBL_1466191
Residue:462
BDBM31892
NameBDBM31892
Synonyms:9-cis retinoic acid CHEMBL705 alitretinoin
TypeSmall organic molecule
Emp. Form.C20H28O2
Mol. Mass.300.4351
SMILESC\C(\C=C\C1=C(C)CCCC1(C)C)=C\C=C\C(\C)=C\C(O)=O