Reaction Details
TargetAlpha-2B adrenergic receptor
LigandBDBM86731
Substrate/Competitorn/a
Meas. Tech.ChEMBL_33360 (CHEMBL644764)
Ki>5000±n/a nM
Citation Hieble, JPBondinell, WERuffolo, RR Alpha- and beta-adrenoceptors: from the gene to the clinic. 1. Molecular biology and adrenoceptor subclassification. J Med Chem38:3415-44 (1995) Alpha-2B adrenergic receptor
Name:Alpha-2B adrenergic receptor
Type:Enzyme
Mol. Mass.:49964.20
Organism:Homo sapiens (Human)
Description:P18089
Residue:450
BDBM86731
NameBDBM86731
Synonyms:CAS_74191-85-8 UK 33,274
TypeSmall organic molecule
Emp. Form.C23H25N5O5
Mol. Mass.451.4751
SMILESCOc1cc2nc(nc(N)c2cc1OC)N1CCN(CC1)C(=O)C1COc2ccccc2O1