Reaction Details
TargetAlpha-1A adrenergic receptor
LigandBDBM50033110
Substrate/Competitorn/a
Meas. Tech.ChEMBL_33747 (CHEMBL647665)
Ki 8.2±n/a nM
Citation Hieble, JPBondinell, WERuffolo, RR Alpha- and beta-adrenoceptors: from the gene to the clinic. 1. Molecular biology and adrenoceptor subclassification. J Med Chem38:3415-44 (1995) Alpha-1A adrenergic receptor
Name:Alpha-1A adrenergic receptor
Type:Cell-surface receptors
Mol. Mass.:51511.67
Organism:Homo sapiens (Human)
Description:P35348
Residue:466
BDBM50033110
NameBDBM50033110
Synonyms:ALFUZOSIN N-{3-[(4-amino-6,7-dimethoxyquinazolin-2-yl)(methyl)amino]propyl}tetrahydrofuran-2-carboxamide
TypeSmall organic molecule
Emp. Form.C19H27N5O4
Mol. Mass.389.4488
SMILESCOc1cc2nc(nc(N)c2cc1OC)N(C)CCCNC(=O)C1CCCO1