Reaction Details
TargetAlpha-1D adrenergic receptor
LigandBDBM86731
Substrate/Competitorn/a
Meas. Tech.ChEMBL_32457 (CHEMBL643573)
Ki 1.2±n/a nM
Citation Hieble, JPBondinell, WERuffolo, RR Alpha- and beta-adrenoceptors: from the gene to the clinic. 1. Molecular biology and adrenoceptor subclassification. J Med Chem38:3415-44 (1995) Alpha-1D adrenergic receptor
Name:Alpha-1D adrenergic receptor
Type:Enzyme Catalytic Domain
Mol. Mass.:60485.82
Organism:Homo sapiens (Human)
Description:adrenergic Alpha1D ADRA1D HUMAN::P25100
Residue:572
BDBM86731
NameBDBM86731
Synonyms:CAS_74191-85-8 UK 33,274
TypeSmall organic molecule
Emp. Form.C23H25N5O5
Mol. Mass.451.4751
SMILESCOc1cc2nc(nc(N)c2cc1OC)N1CCN(CC1)C(=O)C1COc2ccccc2O1