Reaction Details
TargetAlpha-1A adrenergic receptor
LigandBDBM50033112
Substrate/Competitorn/a
Meas. Tech.ChEMBL_34035 (CHEMBL873057)
Ki 0.7±n/a nM
Citation Hieble, JPBondinell, WERuffolo, RR Alpha- and beta-adrenoceptors: from the gene to the clinic. 1. Molecular biology and adrenoceptor subclassification. J Med Chem38:3415-44 (1995) Alpha-1A adrenergic receptor
Name:Alpha-1A adrenergic receptor
Type:Protein
Mol. Mass.:51620.15
Organism:Rattus norvegicus (Rat)
Description:P43140
Residue:466
BDBM50033112
NameBDBM50033112
Synonyms:6-{3-[4-(2-Methoxy-phenyl)-piperazin-1-yl]-propylamino}-1,3,5-trimethyl-1H-pyrimidine-2,4-dione Urapidil-5-methyl
TypeSmall organic molecule
Emp. Form.C21H31N5O3
Mol. Mass.401.5025
SMILESCOc1ccccc1N1CCN(CCCNc2c(C)c(=O)n(C)c(=O)n2C)CC1