Reaction Details
TargetKappa-type opioid receptor
LigandBDBM50033143
Substrate/Competitorn/a
Meas. Tech.ChEMBL_145799 (CHEMBL756066)
IC50 0.580±n/a nM
Citation Meyer, JPDavis, PLee, KBPorreca, FYamamura, HIHruby, VJ Synthesis using a Fmoc-based strategy and biological activities of some reduced peptide bond pseudopeptide analogues of dynorphin A1. J Med Chem38:3462-8 (1995) Kappa-type opioid receptor
Name:Kappa-type opioid receptor
Type:G Protein-Coupled Receptor (GPCR)
Mol. Mass.:42744.99
Organism:Cavia porcellus (domestic guinea pig)
Description:P41144
Residue:380
BDBM50033143
NameBDBM50033143
Synonyms:CHEMBL216640 | H-Tyr-Gly-Gly-Phe-Leu-Arg-Lys-Ile*-Lys*-Pro-Lys-Leu-Lys-Trp-Asp-Asn-Gln-OH
TypeSmall organic molecule
Emp. Form.C63H104N22O12
Mol. Mass.1361.6401
SMILES[#6]-[#6]-[#6@H](-[#6])-[#6@H](-[#7]-[#6](=O)-[#6@H](-[#6]-[#6]-[#6]\[#7]=[#6](\[#7])-[#7])-[#7]-[#6](=O)-[#6@H](-[#6]-[#6]-[#6]\[#7]=[#6](\[#7])-[#7])-[#7]-[#6](=O)-[#6@H](-[#6]-[#6](-[#6])-[#6])-[#7]-[#6](=O)-[#6@H](-[#6]-c1ccccc1)-[#7]-[#6](=O)-[#6]-[#7]-[#6](=O)-[#6]-[#7]-[#6](=O)-[#6@@H](-[#7])-[#6]-c1ccc(-[#8])cc1)-[#6](=O)-[#7]-[#6@@H](-[#6]-[#6]-[#6]\[#7]=[#6](\[#7])-[#7])-[#6](=O)-[#7]-1-[#6]-[#6]-[#6]-[#6@H]-1-[#6](=O)-[#7]-[#6@@H](-[#6]-[#6]-[#6]-[#6]-[#7])-[#6](-[#7])=O