Reaction Details
TargetDelta-type opioid receptor
LigandBDBM50033532
Substrate/Competitorn/a
Meas. Tech.ChEMBL_146340 (CHEMBL753789)
Ki>10000±n/a nM
Citation Wang, ZXZhu, YCJin, WQChen, XJChen, JJi, RYChi, ZQ Stereoisomers of N-[1-hydroxy-(2-phenylethyl)-3-methyl-4-piperidyl]- N-phenylpropanamide: synthesis, stereochemistry, analgesic activity, and opioid receptor binding characteristics. J Med Chem38:3652-9 (1995) Delta-type opioid receptor
Name:Delta-type opioid receptor
Type:Enzyme Catalytic Domain
Mol. Mass.:40577.25
Organism:MOUSE
Description:P32300
Residue:372
BDBM50033532
NameBDBM50033532
Synonyms:CHEMBL435380 N-[1-(2-Hydroxy-2-phenyl-ethyl)-3-methyl-piperidin-4-yl]-N-phenyl-propionamide(2'R,3S,4R)-cis-ohmefentanyl
TypeSmall organic molecule
Emp. Form.C23H30N2O2
Mol. Mass.366.4965
SMILESCCC(=O)N([C@@H]1CCN(C[C@H](O)c2ccccc2)C[C@@H]1C)c1ccccc1