Reaction Details
TargetMu-type opioid receptor
LigandBDBM50033533
Substrate/Competitorn/a
Meas. Tech.ChEMBL_148516 (CHEMBL758126)
Ki 0.06±n/a nM
Citation Wang, ZXZhu, YCJin, WQChen, XJChen, JJi, RYChi, ZQ Stereoisomers of N-[1-hydroxy-(2-phenylethyl)-3-methyl-4-piperidyl]- N-phenylpropanamide: synthesis, stereochemistry, analgesic activity, and opioid receptor binding characteristics. J Med Chem38:3652-9 (1995) Mu-type opioid receptor
Name:Mu-type opioid receptor
Type:Enzyme Catalytic Domain
Mol. Mass.:44431.62
Organism:MOUSE
Description:OPIATE Mu OPRM1 MOUSE::P42866
Residue:398
BDBM50033533
NameBDBM50033533
Synonyms:CHEMBL121403 | N-[(3R,4R)-1-((S)-2-Hydroxy-2-phenyl-ethyl)-3-methyl-piperidin-4-yl]-N-phenyl-propionamide
TypeSmall organic molecule
Emp. Form.C23H30N2O2
Mol. Mass.366.4965
SMILESCCC(=O)N([C@@H]1CCN(C[C@@H](O)c2ccccc2)C[C@H]1C)c1ccccc1