Reaction Details
TargetReverse transcriptase/RNaseH
LigandBDBM1434
Substrate/Competitorn/a
Meas. Tech.ChEMBL_196795 (CHEMBL802186)
IC50 430±n/a nM
Citation Schäfer, WFriebe, WGLeinert, HMertens, APoll, Tvon der Saal, WZilch, HNuber, BZiegler, ML Non-nucleoside inhibitors of HIV-1 reverse transcriptase: molecular modeling and X-ray structure investigations. J Med Chem36:726-32 (1993) Reverse transcriptase/RNaseH
Name:Reverse transcriptase/RNaseH
Type:PROTEIN
Mol. Mass.:65229.15
Organism:Human immunodeficiency virus 1
Description:ChEMBL_1473730
Residue:566
BDBM1434
NameBDBM1434
Synonyms:11-cyclopropyl-5,11-dihydro-4-methyl-6H-dipyrido[3,2-b:2 ,3 -e][1,4]diazepin-6-one BI-RG-587 Nevirapine US11420959, Example NVP | Viramune
TypeSmall organic molecule
Emp. Form.C15H14N4O
Mol. Mass.266.2979
SMILESCc1ccnc2N(C3CC3)c3ncccc3C(=O)Nc12