Reaction Details
TargetReverse transcriptase/RNaseH
LigandBDBM1361
Substrate/Competitorn/a
Meas. Tech.ChEMBL_196795 (CHEMBL802186)
IC50 150±n/a nM
Citation Schäfer, WFriebe, WGLeinert, HMertens, APoll, Tvon der Saal, WZilch, HNuber, BZiegler, ML Non-nucleoside inhibitors of HIV-1 reverse transcriptase: molecular modeling and X-ray structure investigations. J Med Chem36:726-32 (1993) Reverse transcriptase/RNaseH
Name:Reverse transcriptase/RNaseH
Type:PROTEIN
Mol. Mass.:65229.15
Organism:Human immunodeficiency virus 1
Description:ChEMBL_1473730
Residue:566
BDBM1361
NameBDBM1361
Synonyms:9b-(naphthalen-1-yl)-2H,3H,5H,9bH-isoindolo[1,2-b][1,3]thiazol-5-one Thiazoloisoindol-5-one deriv. 6
TypeSmall organic molecule
Emp. Form.C20H15NOS
Mol. Mass.317.404
SMILESO=C1N2CCSC2(c2ccccc12)c1cccc2ccccc12