Reaction Details
TargetDelta-type opioid receptor
LigandBDBM50033642
Substrate/Competitorn/a
Meas. Tech.ChEBML_146726
IC50 46±n/a nM
Citation Sebastian, ABidlack, JMJiang, QDeecher, DTeitler, MGlick, SDArcher, S 14 beta-[(p-nitrocinnamoyl)amino]morphinones, 14 beta-[(p-nitrocinnamoyl)amino]-7,8-dihydromorphinones, and their codeinone analogues: synthesis and receptor activity. J Med Chem36:3154-60 (1993) Delta-type opioid receptor
Name:Delta-type opioid receptor
Type:G Protein-Coupled Receptor (GPCR)
Mol. Mass.:40382.98
Organism:Homo sapiens (Human)
Description:Competition binding assays were carried out using membrane preparations from transfected HN9.10 cells that constitutively expressed the delta opioid receptor.
Residue:372
BDBM50033642
NameBDBM50033642
Synonyms:1N-[10-methoxy-4-methyl-14-oxo-(13R,17S)-12-oxa-4-azapentacyclo[9.6.1.01,13.05,17.07,18]octadeca-7(18),8,10,15-tetraen-17-yl]-4-(4-nitrophenyl)-(Z)-2-butenamide | CHEMBL108794
TypeSmall organic molecule
Emp. Form.C27H25N3O6
Mol. Mass.487.5039
SMILESCOc1ccc2CC3N(C)CCC45[C@@H](Oc1c24)C(=O)C=C[C@@]35NC(=O)C=Cc1ccc(cc1)[N+]([O-])=O