Reaction Details
TargetMu-type opioid receptor
LigandBDBM50033648
Substrate/Competitorn/a
Meas. Tech.ChEBML_136067
IC50 0.800000±n/a nM
Citation Sebastian, ABidlack, JMJiang, QDeecher, DTeitler, MGlick, SDArcher, S 14 beta-[(p-nitrocinnamoyl)amino]morphinones, 14 beta-[(p-nitrocinnamoyl)amino]-7,8-dihydromorphinones, and their codeinone analogues: synthesis and receptor activity. J Med Chem36:3154-60 (1993) Mu-type opioid receptor
Name:Mu-type opioid receptor
Type:Enzyme Catalytic Domain
Mol. Mass.:45038.37
Organism:CALF
Description:OPIATE Mu 2 0 CALF::P79350
Residue:401
BDBM50033648
NameBDBM50033648
Synonyms:1N-[10-hydroxy-4,13-dimethyl-14-oxo-(13R,17S)-12-oxa-4-azapentacyclo[9.6.1.01,13.05,17.07,18]octadeca-7(18),8,10,15-tetraen-17-yl]-4-(4-nitrophenyl)-(Z)-2-butenamide | CHEMBL323430
TypeSmall organic molecule
Emp. Form.C27H25N3O6
Mol. Mass.487.5039
SMILESCN1CCC23c4c5O[C@@]2(C)C(=O)C=C[C@@]3(NC(=O)\C=C\c2ccc(cc2)[N+]([O-])=O)C1Cc4ccc5O