Reaction Details
TargetDelta-type opioid receptor
LigandBDBM50033651
Substrate/Competitorn/a
Meas. Tech.ChEBML_146726
IC50 4.4±n/a nM
Citation Sebastian, ABidlack, JMJiang, QDeecher, DTeitler, MGlick, SDArcher, S 14 beta-[(p-nitrocinnamoyl)amino]morphinones, 14 beta-[(p-nitrocinnamoyl)amino]-7,8-dihydromorphinones, and their codeinone analogues: synthesis and receptor activity. J Med Chem36:3154-60 (1993) Delta-type opioid receptor
Name:Delta-type opioid receptor
Type:G Protein-Coupled Receptor (GPCR)
Mol. Mass.:40382.98
Organism:Homo sapiens (Human)
Description:Competition binding assays were carried out using membrane preparations from transfected HN9.10 cells that constitutively expressed the delta opioid receptor.
Residue:372
BDBM50033651
NameBDBM50033651
Synonyms:1N-[10-hydroxy-4-methyl-14-oxo-(13R,17S)-12-oxa-4-azapentacyclo[9.6.1.01,13.05,17.07,18]octadeca-7(18),8,10,15-tetraen-17-yl]-4-(4-nitrophenyl)-(Z)-2-butenamide | CHEMBL110238
TypeSmall organic molecule
Emp. Form.C26H23N3O6
Mol. Mass.473.4773
SMILESCN1CCC23[C@H]4Oc5c2c(CC1[C@]3(NC(=O)C=Cc1ccc(cc1)[N+]([O-])=O)C=CC4=O)ccc5O