Reaction Details
TargetKappa-type opioid receptor
LigandBDBM50456193
Substrate/Competitorn/a
Meas. Tech.ChEBML_145505
IC50 6.6±n/a nM
Citation Sebastian, ABidlack, JMJiang, QDeecher, DTeitler, MGlick, SDArcher, S 14 beta-[(p-nitrocinnamoyl)amino]morphinones, 14 beta-[(p-nitrocinnamoyl)amino]-7,8-dihydromorphinones, and their codeinone analogues: synthesis and receptor activity. J Med Chem36:3154-60 (1993) Kappa-type opioid receptor
Name:Kappa-type opioid receptor
Type:G Protein-Coupled Receptor (GPCR)
Mol. Mass.:42648.76
Organism:Homo sapiens (Human)
Description:P41145
Residue:380
BDBM50456193
NameBDBM50456193
Synonyms:CHEMBL607068
TypeSmall organic molecule
Emp. Form.C26H25N3O6
Mol. Mass.475.4932
SMILES[H][C@@]12Oc3c4c(C[C@@]5([H])N(C)CC[C@@]14[C@]5(CCC2=O)NC(=O)\C=C\c1ccc(cc1)[N+]([O-])=O)ccc3O