Reaction Details
TargetKappa-type opioid receptor
LigandBDBM50033641
Substrate/Competitorn/a
Meas. Tech.ChEBML_145505
IC50 12±n/a nM
Citation Sebastian, ABidlack, JMJiang, QDeecher, DTeitler, MGlick, SDArcher, S 14 beta-[(p-nitrocinnamoyl)amino]morphinones, 14 beta-[(p-nitrocinnamoyl)amino]-7,8-dihydromorphinones, and their codeinone analogues: synthesis and receptor activity. J Med Chem36:3154-60 (1993) Kappa-type opioid receptor
Name:Kappa-type opioid receptor
Type:G Protein-Coupled Receptor (GPCR)
Mol. Mass.:42648.76
Organism:Homo sapiens (Human)
Description:P41145
Residue:380
BDBM50033641
NameBDBM50033641
Synonyms:1N-[4-cyclopropylmethyl-10-hydroxy-14-oxo-(13R,17S)-12-oxa-4-azapentacyclo[9.6.1.01,13.05,17.07,18]octadeca-7(18),8,10-trien-17-yl]-4-(4-nitrophenyl)-(Z)-2-butenamide | CHEMBL611136
TypeSmall organic molecule
Emp. Form.C29H29N3O6
Mol. Mass.515.5571
SMILES[H][C@@]12Oc3c4c(C[C@@]5([H])N(CC6CC6)CC[C@@]14[C@]5(CCC2=O)NC(=O)\C=C\c1ccc(cc1)[N+]([O-])=O)ccc3O