Reaction Details
TargetKappa-type opioid receptor
LigandBDBM50033657
Substrate/Competitorn/a
Meas. Tech.ChEBML_145505
IC50 5±n/a nM
Citation Sebastian, ABidlack, JMJiang, QDeecher, DTeitler, MGlick, SDArcher, S 14 beta-[(p-nitrocinnamoyl)amino]morphinones, 14 beta-[(p-nitrocinnamoyl)amino]-7,8-dihydromorphinones, and their codeinone analogues: synthesis and receptor activity. J Med Chem36:3154-60 (1993) Kappa-type opioid receptor
Name:Kappa-type opioid receptor
Type:G Protein-Coupled Receptor (GPCR)
Mol. Mass.:42648.76
Organism:Homo sapiens (Human)
Description:P41145
Residue:380
BDBM50033657
NameBDBM50033657
Synonyms:1N-[4-cyclopropylmethyl-10-methoxy-14-oxo-(13R,17S)-12-oxa-4-azapentacyclo[9.6.1.01,13.05,17.07,18]octadeca-7(18),8,10,15-tetraen-17-yl]-4-(4-nitrophenyl)-(Z)-2-butenamide | CHEMBL107157
TypeSmall organic molecule
Emp. Form.C30H29N3O6
Mol. Mass.527.5678
SMILESCOc1ccc2CC3N(CC4CC4)CCC45[C@@H](Oc1c24)C(=O)C=C[C@@]35NC(=O)C=Cc1ccc(cc1)[N+]([O-])=O