Reaction Details
TargetD(2) dopamine receptor
LigandBDBM50001859
Substrate/Competitorn/a
Meas. Tech.ChEMBL_61444 (CHEMBL670670)
IC50 226±n/a nM
Citation Perrone, RBerardi, FColabufo, NALeopoldo, MTortorella, VFiorentini, FOlgiati, VGhiglieri, AGovoni, S High affinity and selectivity on 5-HT1A receptor of 1-aryl-4-[1-tetralin)alkyl]piperazines. 2. J Med Chem38:942-9 (1995) D(2) dopamine receptor
Name:D(2) dopamine receptor
Type:G Protein-Coupled Receptor (GPCR)
Mol. Mass.:50931.60
Organism:Rattus norvegicus (rat)
Description:P61169
Residue:444
BDBM50001859
NameBDBM50001859
Synonyms:(buspirone) 8-[4-(4-Pyrimidin-2-yl-piperazin-1-yl)-butyl]-8-aza-spiro[4.5]decane-7,9-dione 8-[4-(4-Pyrimidin-2-yl-piperazin-1-yl)-butyl]-8-aza-spiro[4.5]decane-7,9-dione; Hydrochloride(Buspirone) BUSPAR CHEMBL49 | US10562853, Compound Buspirone
TypeSmall organic molecule
Emp. Form.C21H31N5O2
Mol. Mass.385.5031
SMILESO=C1CC2(CCCC2)CC(=O)N1CCCCN1CCN(CC1)c1ncccn1