Reaction Details
TargetThymidylate synthase
LigandBDBM50033913
Substrate/Competitorn/a
Meas. Tech.ChEMBL_209795 (CHEMBL815661)
IC50 9.0±n/a nM
Citation Marsham, PRJackman, ALBarker, AJBoyle, FTPegg, SJWardleworth, JMKimbell, RO'Connor, BMCalvert, AHHughes, LR Quinazoline antifolate thymidylate synthase inhibitors: replacement of glutamic acid in the C2-methyl series. J Med Chem38:994-1004 (1995) Thymidylate synthase
Name:Thymidylate synthase
Type:PROTEIN
Mol. Mass.:34957.15
Organism:Mus musculus
Description:ChEMBL_1340097
Residue:307
BDBM50033913
NameBDBM50033913
Synonyms:(R)-2-{4-[(2,7-Dimethyl-4-oxo-3,4-dihydro-quinazolin-6-ylmethyl)-prop-2-ynyl-amino]-2-fluoro-benzoylamino}-pentanedioic acid | CHEMBL414012
TypeSmall organic molecule
Emp. Form.C26H25FN4O6
Mol. Mass.508.4983
SMILESCc1nc2cc(C)c(CN(CC#C)c3ccc(C(=O)N[C@H](CCC(O)=O)C(O)=O)c(F)c3)cc2c(=O)[nH]1