Reaction Details
TargetSterol O-acyltransferase 1
LigandBDBM50033969
Substrate/Competitorn/a
Meas. Tech.ChEMBL_28792 (CHEMBL641702)
IC50 10±n/a nM
Citation Maduskuie, TPWilde, RGBillheimer, JTCromley, DAGermain, SGillies, PJHigley, CAJohnson, ALPennev, PShimshick, EJ Design, synthesis, and structure--activity relationship studies for a new imidazole series of J774 macrophage specific acyl-CoA:cholesterol acyltransferase (ACAT) inhibitors. J Med Chem38:1067-83 (1995) Sterol O-acyltransferase 1
Name:Sterol O-acyltransferase 1
Type:PROTEIN
Mol. Mass.:64165.56
Organism:Rattus norvegicus
Description:ChEMBL_28796
Residue:545
BDBM50033969
NameBDBM50033969
Synonyms:3-(2,4-Difluoro-phenyl)-1-[5-(4,5-diphenyl-1H-imidazol-2-ylsulfanyl)-pentyl]-1-heptyl-urea Lecimibide
TypeSmall organic molecule
Emp. Form.C34H40F2N4OS
Mol. Mass.590.769
SMILESCCCCCCCN(CCCCCSc1nc(c([nH]1)-c1ccccc1)-c1ccccc1)C(=O)Nc1ccc(F)cc1F