Reaction Details
TargetSterol O-acyltransferase 1
LigandBDBM50033950
Substrate/Competitorn/a
Meas. Tech.ChEMBL_28792 (CHEMBL641702)
IC50 20±n/a nM
Citation Maduskuie, TPWilde, RGBillheimer, JTCromley, DAGermain, SGillies, PJHigley, CAJohnson, ALPennev, PShimshick, EJ Design, synthesis, and structure--activity relationship studies for a new imidazole series of J774 macrophage specific acyl-CoA:cholesterol acyltransferase (ACAT) inhibitors. J Med Chem38:1067-83 (1995) Sterol O-acyltransferase 1
Name:Sterol O-acyltransferase 1
Type:PROTEIN
Mol. Mass.:64165.56
Organism:Rattus norvegicus
Description:ChEMBL_28796
Residue:545
BDBM50033950
NameBDBM50033950
Synonyms:3-(2,4-Difluoro-phenyl)-1-[5-(4,5-diisopropyl-1H-imidazol-2-ylsulfanyl)-pentyl]-1-heptyl-urea | CHEMBL11254
TypeSmall organic molecule
Emp. Form.C28H44F2N4OS
Mol. Mass.522.737
SMILESCCCCCCCN(CCCCCSc1nc(C(C)C)c([nH]1)C(C)C)C(=O)Nc1ccc(F)cc1F