Reaction Details
TargetSterol O-acyltransferase 1
LigandBDBM50033985
Substrate/Competitorn/a
Meas. Tech.ChEMBL_28792 (CHEMBL641702)
IC50 640±n/a nM
Citation Maduskuie, TPWilde, RGBillheimer, JTCromley, DAGermain, SGillies, PJHigley, CAJohnson, ALPennev, PShimshick, EJ Design, synthesis, and structure--activity relationship studies for a new imidazole series of J774 macrophage specific acyl-CoA:cholesterol acyltransferase (ACAT) inhibitors. J Med Chem38:1067-83 (1995) Sterol O-acyltransferase 1
Name:Sterol O-acyltransferase 1
Type:PROTEIN
Mol. Mass.:64165.56
Organism:Rattus norvegicus
Description:ChEMBL_28796
Residue:545
BDBM50033985
NameBDBM50033985
Synonyms:CHEMBL11071 | {5-[4,5-Bis-(4-methoxy-phenyl)-1H-imidazol-2-ylsulfanyl]-pentyl}-heptyl-carbamic acid phenyl ester
TypeSmall organic molecule
Emp. Form.C36H45N3O4S
Mol. Mass.615.825
SMILESCCCCCCCN(CCCCCSc1nc(c([nH]1)-c1ccc(OC)cc1)-c1ccc(OC)cc1)C(=O)Oc1ccccc1