Reaction Details
TargetEndothelin-1 receptor
LigandBDBM50034259
Substrate/Competitorn/a
Meas. Tech.ChEMBL_65502 (CHEMBL876876)
IC50 1.8±n/a nM
Citation Doherty, AMPatt, WCEdmunds, JJBerryman, KAReisdorph, BRPlummer, MSShahripour, ALee, CCheng, XMWalker, DM Discovery of a novel series of orally active non-peptide endothelin-A (ETA) receptor-selective antagonists. J Med Chem38:1259-63 (1995) Endothelin-1 receptor
Name:Endothelin-1 receptor
Type:Enzyme Catalytic Domain
Mol. Mass.:48736.88
Organism:Homo sapiens (Human)
Description:P25101
Residue:427
BDBM50034259
NameBDBM50034259
Synonyms:3-Benzo[1,3]dioxol-5-yl-5-hydroxy-4-(4-methoxy-benzyl)-5-(4-methoxy-phenyl)-5H-furan-2-one | CHEMBL11115
TypeSmall organic molecule
Emp. Form.C26H22O7
Mol. Mass.446.4487
SMILESCOc1ccc(CC2=C(C(=O)OC2(O)c2ccc(OC)cc2)c2ccc3OCOc3c2)cc1