Reaction Details
TargetProtein-S-isoprenylcysteine O-methyltransferase
LigandBDBM50034280
Substrate/Competitorn/a
Meas. Tech.ChEMBL_158698 (CHEMBL763229)
Ki 8000±n/a nM
Citation Marciano, DBen-Baruch, GMarom, MEgozi, YHaklai, RKloog, Y Farnesyl derivatives of rigid carboxylic acids-inhibitors of ras-dependent cell growth. J Med Chem38:1267-72 (1995) Protein-S-isoprenylcysteine O-methyltransferase
Name:Protein-S-isoprenylcysteine O-methyltransferase
Type:PROTEIN
Mol. Mass.:26663.61
Organism:Rattus norvegicus
Description:ChEMBL_158698
Residue:232
BDBM50034280
NameBDBM50034280
Synonyms:2-Chloro-5-((2E,6E)-3,7,11-trimethyl-dodeca-2,6,10-trienylamino)-benzoic acid | CHEMBL23751
TypeSmall organic molecule
Emp. Form.C22H30ClNO2
Mol. Mass.375.932
SMILES[#6]\[#6](-[#6])=[#6]/[#6]-[#6]\[#6](-[#6])=[#6]\[#6]-[#6]\[#6](-[#6])=[#6]\[#6]-[#7]-c1ccc(Cl)c(c1)-[#6](-[#8])=O