Reaction Details
Target5-hydroxytryptamine receptor 1A
LigandBDBM50034323
Substrate/Competitorn/a
Meas. Tech.ChEMBL_589 (CHEMBL615459)
Ki 11±n/a nM
Citation Jain, ANHarris, NLPark, JY Quantitative binding site model generation: compass applied to multiple chemotypes targeting the 5-HT1A receptor. J Med Chem38:1295-308 (1995) 5-hydroxytryptamine receptor 1A
Name:5-hydroxytryptamine receptor 1A
Type:n/a
Mol. Mass.:46122.49
Organism:Homo sapiens (Human)
Description:n/a
Residue:422
BDBM50034323
NameBDBM50034323
Synonyms:(2 beta-methyl) 8-Methoxy-2-methyl-1-propyl-2,3,3a,4,9,9a-hexahydro-1H-benzo[f]indole 8-Methoxy-2-methyl-1-propyl-2,3,3a,4,9,9a-hexahydro-1H-benzo[f]indole | CHEMBL11386
TypeSmall organic molecule
Emp. Form.C17H25NO
Mol. Mass.259.3865
SMILESCCCN1[C@@H](C)C[C@@H]2Cc3cccc(OC)c3C[C@H]12