Reaction Details
Target5-hydroxytryptamine receptor 1A
LigandBDBM50034331
Substrate/Competitorn/a
Meas. Tech.ChEMBL_589 (CHEMBL615459)
Ki 0.2±n/a nM
Citation Jain, ANHarris, NLPark, JY Quantitative binding site model generation: compass applied to multiple chemotypes targeting the 5-HT1A receptor. J Med Chem38:1295-308 (1995) 5-hydroxytryptamine receptor 1A
Name:5-hydroxytryptamine receptor 1A
Type:n/a
Mol. Mass.:46122.49
Organism:Homo sapiens (Human)
Description:n/a
Residue:422
BDBM50034331
NameBDBM50034331
Synonyms:(3aS,9bS)-9-Methoxy-3-propyl-2,3,3a,4,5,9b-hexahydro-1H-benzo[e]indole | CHEMBL281819
TypeSmall organic molecule
Emp. Form.C16H23NO
Mol. Mass.245.3599
SMILESCCCN1CC[C@@H]2[C@@H]1CCc1cccc(OC)c21