Reaction Details
Target5-hydroxytryptamine receptor 1A
LigandBDBM50034340
Substrate/Competitorn/a
Meas. Tech.ChEMBL_589 (CHEMBL615459)
Ki 317±n/a nM
Citation Jain, ANHarris, NLPark, JY Quantitative binding site model generation: compass applied to multiple chemotypes targeting the 5-HT1A receptor. J Med Chem38:1295-308 (1995) 5-hydroxytryptamine receptor 1A
Name:5-hydroxytryptamine receptor 1A
Type:n/a
Mol. Mass.:46122.49
Organism:Homo sapiens (Human)
Description:n/a
Residue:422
BDBM50034340
NameBDBM50034340
Synonyms:(3aR,9bS)-9-Methoxy-3-phenethyl-2,3,3a,4,5,9b-hexahydro-1H-benzo[e]indole | CHEMBL286376
TypeSmall organic molecule
Emp. Form.C21H25NO
Mol. Mass.307.4293
SMILESCOc1cccc2CC[C@@H]3[C@@H](CCN3CCc3ccccc3)c12