Reaction Details
Target5-hydroxytryptamine receptor 1A
LigandBDBM50034341
Substrate/Competitorn/a
Meas. Tech.ChEMBL_589 (CHEMBL615459)
Ki 333±n/a nM
Citation Jain, ANHarris, NLPark, JY Quantitative binding site model generation: compass applied to multiple chemotypes targeting the 5-HT1A receptor. J Med Chem38:1295-308 (1995) 5-hydroxytryptamine receptor 1A
Name:5-hydroxytryptamine receptor 1A
Type:n/a
Mol. Mass.:46122.49
Organism:Homo sapiens (Human)
Description:n/a
Residue:422
BDBM50034341
NameBDBM50034341
Synonyms:(3aR,9bS)-3-allyl-6-methoxy-2,3,3a,4,5,9b-hexahydro-1H-benzo[e]indole CHEMBL280955
TypeSmall organic molecule
Emp. Form.C16H21NO
Mol. Mass.243.344
SMILESCOc1cccc2[C@@H]3CCN(CC=C)[C@@H]3CCc12