Reaction Details
Target5-hydroxytryptamine receptor 1A
LigandBDBM50034361
Substrate/Competitorn/a
Meas. Tech.ChEMBL_589 (CHEMBL615459)
Ki 127±n/a nM
Citation Jain, ANHarris, NLPark, JY Quantitative binding site model generation: compass applied to multiple chemotypes targeting the 5-HT1A receptor. J Med Chem38:1295-308 (1995) 5-hydroxytryptamine receptor 1A
Name:5-hydroxytryptamine receptor 1A
Type:n/a
Mol. Mass.:46122.49
Organism:Homo sapiens (Human)
Description:n/a
Residue:422
BDBM50034361
NameBDBM50034361
Synonyms:(3aS,9aR)-1-Benzyl-5-methoxy-2,3,3a,4,9,9a-hexahydro-1H-benzo[f]indole CHEMBL11880
TypeSmall organic molecule
Emp. Form.C20H23NO
Mol. Mass.293.4027
SMILESCOc1cccc2C[C@@H]3[C@H](CCN3Cc3ccccc3)Cc12