Reaction Details
TargetDelta-type opioid receptor
LigandBDBM50034407
Substrate/Competitorn/a
Meas. Tech.ChEMBL_145074 (CHEMBL754634)
Ki 0.038000±n/a nM
Citation Korlipara, VLTakemori, AEPortoghese, PS Electrophilic N-benzylnaltrindoles as delta opioid receptor-selective antagonists. J Med Chem38:1337-43 (1995) Delta-type opioid receptor
Name:Delta-type opioid receptor
Type:G Protein-Coupled Receptor (GPCR)
Mol. Mass.:40382.98
Organism:Homo sapiens (Human)
Description:Competition binding assays were carried out using membrane preparations from transfected HN9.10 cells that constitutively expressed the delta opioid receptor.
Residue:372
BDBM50034407
NameBDBM50034407
Synonyms:1N-{3-[22-cyclopropylmethyl-2,16-dihydroxy-14-oxa-11,22-diazaheptacyclo[13.9.1.01,13.02,21.04,12.05,10.019,25]pentacosa-4(12),5(10),6,8,15,17,19(25)-heptaen-11-ylmethyl]phenyl}-2-bromoacetamide | CHEMBL282518
TypeSmall organic molecule
Emp. Form.C35H34BrN3O4
Mol. Mass.640.566
SMILESOc1ccc2CC3N(CC4CC4)CCC45[C@@H](Oc1c24)c1c(C[C@@]35O)c2ccccc2n1Cc1cccc(NC(=O)CBr)c1