Reaction Details
TargetEndothelin-1 receptor
LigandBDBM50034428
Substrate/Competitorn/a
Meas. Tech.ChEMBL_63217 (CHEMBL674069)
IC50 30±n/a nM
Citation Stein, PDFloyd, DMBisaha, SDickey, JGirotra, RNGougoutas, JZKozlowski, MLee, VGLiu, ECMalley, MF Discovery and structure-activity relationships of sulfonamide ETA-selective antagonists. J Med Chem38:1344-54 (1995) Endothelin-1 receptor
Name:Endothelin-1 receptor
Type:Enzyme Catalytic Domain
Mol. Mass.:48256.91
Organism:RAT
Description:ENDOTHELIN A EDNRA RAT::P26684
Residue:426
BDBM50034428
NameBDBM50034428
Synonyms:5-Pyrrolidin-1-yl-naphthalene-1-sulfonic acid (3,4-dimethyl-isoxazol-5-yl)-amide | CHEMBL30032
TypeSmall organic molecule
Emp. Form.C19H21N3O3S
Mol. Mass.371.453
SMILESCc1noc(NS(=O)(=O)c2cccc3c(cccc23)N2CCCC2)c1C