Reaction Details
TargetProthrombin
LigandBDBM50034582
Substrate/Competitorn/a
Meas. Tech.ChEMBL_208173 (CHEMBL819079)
Ki 1±n/a nM
Citation Deadman, JJElgendy, SGoodwin, CAGreen, DBaban, JAPatel, GSkordalakes, EChino, NClaeson, GKakkar, VV Characterization of a class of peptide boronates with neutral P1 side chains as highly selective inhibitors of thrombin. J Med Chem38:1511-22 (1995) Prothrombin
Name:Prothrombin
Type:Protein
Mol. Mass.:70029.57
Organism:Homo sapiens (Human)
Description:P00734
Residue:622
BDBM50034582
NameBDBM50034582
Synonyms:CHEMBL2448441 | Peptide boronate
TypeSmall organic molecule
Emp. Form.C37H51BBrN5O6S
Mol. Mass.784.611
SMILESBr.[H][C@@]12CC3CC(C3(C)C)[C@]1(C)OB(O2)C(CCC\C(S)=N\N)NC(=O)[C@@H]1CCCN1C(=O)[C@H](Cc1ccccc1)NC(=O)OCc1ccccc1