Reaction Details
TargetKallikrein-1
LigandBDBM50034573
Substrate/Competitorn/a
Meas. Tech.ChEMBL_92368 (CHEMBL701582)
Ki>63±n/a nM
Citation Deadman, JJElgendy, SGoodwin, CAGreen, DBaban, JAPatel, GSkordalakes, EChino, NClaeson, GKakkar, VV Characterization of a class of peptide boronates with neutral P1 side chains as highly selective inhibitors of thrombin. J Med Chem38:1511-22 (1995) Kallikrein-1
Name:Kallikrein-1
Type:Enzyme
Mol. Mass.:28874.69
Organism:Homo sapiens (Human)
Description:P06870
Residue:262
BDBM50034573
NameBDBM50034573
Synonyms:CHEMBL291261 | Peptide boronate
TypeSmall organic molecule
Emp. Form.C44H56BN3O6
Mol. Mass.733.743
SMILESCCC(C)(C)C(NC(=O)[C@@H]1CCCN1C(=O)[C@@H](NC(=O)OCc1ccccc1)C(c1ccccc1)c1ccccc1)B1O[C@@H]2CC3CC(C3(C)C)[C@]2(C)O1