Reaction Details
TargetProthrombin
LigandBDBM50034574
Substrate/Competitorn/a
Meas. Tech.ChEMBL_208171 (CHEMBL819272)
Ki 0.007000±n/a nM
Citation Deadman, JJElgendy, SGoodwin, CAGreen, DBaban, JAPatel, GSkordalakes, EChino, NClaeson, GKakkar, VV Characterization of a class of peptide boronates with neutral P1 side chains as highly selective inhibitors of thrombin. J Med Chem38:1511-22 (1995) Prothrombin
Name:Prothrombin
Type:Protein
Mol. Mass.:70029.57
Organism:Homo sapiens (Human)
Description:P00734
Residue:622
BDBM50034574
NameBDBM50034574
Synonyms:CHEMBL288150 | Peptide boronate
TypeSmall organic molecule
Emp. Form.C37H50BN3O7
Mol. Mass.659.62
SMILESCOCCCC(NC(=O)[C@@H]1CCCN1C(=O)[C@H](Cc1ccccc1)NC(=O)OCc1ccccc1)B1O[C@@H]2CC3CC(C3(C)C)[C@]2(C)O1