Reaction Details
TargetProthrombin
LigandBDBM50034575
Substrate/Competitorn/a
Meas. Tech.ChEMBL_208173 (CHEMBL819079)
Ki 1000±n/a nM
Citation Deadman, JJElgendy, SGoodwin, CAGreen, DBaban, JAPatel, GSkordalakes, EChino, NClaeson, GKakkar, VV Characterization of a class of peptide boronates with neutral P1 side chains as highly selective inhibitors of thrombin. J Med Chem38:1511-22 (1995) Prothrombin
Name:Prothrombin
Type:Protein
Mol. Mass.:70029.57
Organism:Homo sapiens (Human)
Description:P00734
Residue:622
BDBM50034575
NameBDBM50034575
Synonyms:CHEMBL36670 | Peptide boronate
TypeSmall organic molecule
Emp. Form.C35H46BN3O6
Mol. Mass.615.567
SMILESCCC(NC(=O)[C@@H]1CCCN1C(=O)[C@H](Cc1ccccc1)NC(=O)OCc1ccccc1)B1O[C@@H]2CC3CC(C3(C)C)[C@]2(C)O1