Reaction Details
TargetCoagulation factor X
LigandBDBM50034582
Substrate/Competitorn/a
Meas. Tech.ChEMBL_48663 (CHEMBL657715)
Ki 0.848±n/a nM
Citation Deadman, JJElgendy, SGoodwin, CAGreen, DBaban, JAPatel, GSkordalakes, EChino, NClaeson, GKakkar, VV Characterization of a class of peptide boronates with neutral P1 side chains as highly selective inhibitors of thrombin. J Med Chem38:1511-22 (1995) Coagulation factor X
Name:Coagulation factor X
Type:Enzyme
Mol. Mass.:54726.60
Organism:Homo sapiens (Human)
Description:n/a
Residue:488
BDBM50034582
NameBDBM50034582
Synonyms:CHEMBL2448441 | Peptide boronate
TypeSmall organic molecule
Emp. Form.C37H51BBrN5O6S
Mol. Mass.784.611
SMILESBr.[H][C@@]12CC3CC(C3(C)C)[C@]1(C)OB(O2)C(CCC\C(S)=N\N)NC(=O)[C@@H]1CCCN1C(=O)[C@H](Cc1ccccc1)NC(=O)OCc1ccccc1