Reaction Details
TargetProthrombin
LigandBDBM50034576
Substrate/Competitorn/a
Meas. Tech.ChEMBL_208172 (CHEMBL819078)
Ki 0.14±n/a nM
Citation Deadman, JJElgendy, SGoodwin, CAGreen, DBaban, JAPatel, GSkordalakes, EChino, NClaeson, GKakkar, VV Characterization of a class of peptide boronates with neutral P1 side chains as highly selective inhibitors of thrombin. J Med Chem38:1511-22 (1995) Prothrombin
Name:Prothrombin
Type:Protein
Mol. Mass.:70029.57
Organism:Homo sapiens (Human)
Description:P00734
Residue:622
BDBM50034576
NameBDBM50034576
Synonyms:CHEMBL288176 | Peptide boronate
TypeSmall organic molecule
Emp. Form.C42H54BN3O6
Mol. Mass.707.706
SMILESCCC(C)(C)C(NC(=O)[C@@H]1CCCN1C(=O)[C@H](Cc1ccc2ccccc2c1)NC(=O)OCc1ccccc1)B1O[C@@H]2CC3CC(C3(C)C)[C@]2(C)O1