Reaction Details
TargetNeutrophil elastase
LigandBDBM50034671
Substrate/Competitorn/a
Meas. Tech.ChEMBL_63982 (CHEMBL677608)
Ki 0.035±n/a nM
Citation Desai, RCCourt, JCFerguson, EGordon, RJHlasta, DJDunlap, RPFranke, CA Phosphonates and phosphinates: novel leaving groups for benzisothiazolone inhibitors of human leukocyte elastase. J Med Chem38:1571-4 (1995) Neutrophil elastase
Name:Neutrophil elastase
Type:Enzyme
Mol. Mass.:28532.38
Organism:Homo sapiens (Human)
Description:P08246
Residue:267
BDBM50034671
NameBDBM50034671
Synonyms:CHEMBL41327 | Phosphoric acid diethyl ester 4-isopropyl-6-methoxy-1,1,3-trioxo-1,3-dihydro-1lambda*6*-benzo[d]isothiazol-2-ylmethyl ester
TypeSmall organic molecule
Emp. Form.C16H24NO8PS
Mol. Mass.421.402
SMILESCCOP(=O)(OCC)OCN1C(=O)c2c(cc(OC)cc2C(C)C)S1(=O)=O